__color__,__group__,__style__,ticket,summary,component,status,resolution,version,type,priority,owner,modified,_time,_reporter
3,,,5819,apply it at their possess threat and after,Unknown/Unsure,new,,0.9.827,defect,major,eskil,2015-10-09T10:32:47+0100,10:32:47+0100,imogeneklavuhnnovt
3,,,5818,All That Is Ruining All Of This British Isles Is Farrah Abraham Video.,Unknown/Unsure,new,,0.9.827,defect,major,eskil,2015-10-09T10:24:21+0100,10:24:21+0100,sayrimabo
4,Version 1.0,,5817,Genuine Resorts & Hotels,Bailout Profile Display,new,,0.9.826,enhancement,minor,eskil,2015-10-09T09:39:08+0100,09:39:08+0100,KristanMcCash61
4,Version 1.0,,5816,Don't Put Your Boxes By The control,Unknown/Unsure,new,,0.9.7.1,enhancement,minor,eskil,2015-10-09T08:37:24+0100,08:37:24+0100,Pearlene95E
3,,,5815,"None. Yes, I never felt",Unknown/Unsure,new,,0.9.827,defect,major,eskil,2015-10-09T08:34:19+0100,08:34:19+0100,ellamaebohlingxrfe
4,Version 1.0,,5814,The True Luxury Travel Expert,Plan Settings,new,,0.9.4,task,minor,eskil,2015-10-09T08:33:50+0100,08:33:50+0100,GraigStephenson
3,,,5813,Get Better Attention And Focus Power With adderin,Unknown/Unsure,new,,0.9.827,defect,major,eskil,2015-10-09T06:50:58+0100,06:50:58+0100,lucyaulay
3,,,5812,Get Better Attention And Focus Power With adderin,Unknown/Unsure,new,,0.9.827,defect,major,eskil,2015-10-09T06:44:25+0100,06:44:25+0100,lucyaulay
3,Version 1.0,,5811,Cleaning goods secure For animals,Plan Settings,new,,0.9.7,task,major,eskil,2015-10-09T06:15:15+0100,06:15:15+0100,DarrylMcComas00
3,,,5810,professionally picked fixings,Unknown/Unsure,new,,0.9.827,defect,major,eskil,2015-10-09T06:05:05+0100,06:05:05+0100,victorbrailsfordkltm
3,,,5809,high-priced treatments like Botox or laser,Unknown/Unsure,new,,0.9.827,defect,major,eskil,2015-10-09T06:00:51+0100,06:00:51+0100,vedfijams
3,,,5808,These are the things which,Unknown/Unsure,new,,0.9.827,defect,major,eskil,2015-10-09T05:59:21+0100,05:59:21+0100,linnpinalxbeo
3,,,5807,Get Amazing Weight Loss Result with Phen375,Unknown/Unsure,new,,0.9.827,enhancement,major,eskil,2015-10-09T05:58:18+0100,05:58:18+0100,joaneewright
4,Version 1.0,,5806,Koh Samui Villas,CNS,new,,0.9.3,enhancement,minor,eskil,2015-10-09T05:50:36+0100,05:50:36+0100,KSSJenny906111
3,,,5805,epidermis medical professionals it's fairly,Unknown/Unsure,new,,0.9.827,defect,major,eskil,2015-10-09T05:18:13+0100,05:18:13+0100,buffyruttyihgi@…
3,,,5804,These are average dietary supplements,Unknown/Unsure,new,,0.9.827,defect,major,eskil,2015-10-09T05:10:43+0100,05:10:43+0100,meghiemerhmpf
3,,,5803,Along With A New Pigs Are Guilty La Tetanic Desnuda You.,Unknown/Unsure,new,,0.9.827,defect,major,eskil,2015-10-09T03:52:15+0100,03:52:15+0100,captthecufes
4,Version 1.0,,5802,Hansar Lodges & Resorts,Unknown/Unsure,new,,0.9.8.2.3,task,minor,eskil,2015-10-09T03:37:54+0100,03:37:54+0100,KSSJenny906111
3,,,5801,Here Is A Crossdresser Xxx Videos Video Was Absolutely Not Nearly As Begging.,Unknown/Unsure,new,,0.9.827,defect,major,eskil,2015-10-09T02:44:18+0100,02:44:18+0100,pupcanate
3,,,5800,I Blog Milo Ventimiglia Naked Accomplish The Task And As They Usually Slinked Off Afterward That.,Unknown/Unsure,new,,0.9.827,defect,major,eskil,2015-10-09T02:08:24+0100,02:08:24+0100,thropisrere
3,,,5799,We Access Some Appealing Fucking Dangerous Snakes Here In Farrah Abraham Free Sex Tape.,Unknown/Unsure,new,,0.9.827,defect,major,eskil,2015-10-09T01:37:09+0100,01:37:09+0100,hardwarmweapho
3,Version 1.0,,5798,Easy methods To adore Your Home,Email Export,new,,0.9.8.1,enhancement,major,eskil,2015-10-09T00:02:56+0100,00:02:56+0100,GregorioVisconti
4,Version 1.0,,5797,Cleaning suggestions For Residential Water Softeners,ZHL16,new,,0.9.8.2.4,enhancement,minor,eskil,2015-10-08T23:09:15+0100,23:09:15+0100,Brock225885916
3,,,5796,Extraordinary kinds of steroids are manufactured,Unknown/Unsure,new,,0.9.827,defect,major,eskil,2015-10-08T19:23:16+0100,19:23:16+0100,qucklezjanee
4,Version 1.0,,5795,"teen cunt pics - Kids, Work and Hot Naked Teen Girl",Level Editor,new,,0.9.5,enhancement,minor,eskil,2015-10-08T16:26:32+0100,16:26:32+0100,ChandaCulbert62
3,,,5794,Accelerin diminishes uneasiness and battle stress,Unknown/Unsure,new,,0.9.827,defect,major,eskil,2015-10-08T12:53:33+0100,12:53:33+0100,zilylijuriya
3,,,5793,What on earth is Supplementtrends Head Booster-style?,Unknown/Unsure,new,,0.9.827,defect,major,eskil,2015-10-08T11:52:32+0100,11:52:32+0100,lppofurewo
3,,,5792,Christina Aguilera Naked Cupcakes Could 2 Bottle As Mech Warrior Cakes.,Unknown/Unsure,new,,0.9.827,defect,major,eskil,2015-10-08T11:39:02+0100,11:39:02+0100,imquitranap
3,,,5791,A companion prescribed this supplement,Unknown/Unsure,new,,0.9.827,defect,major,eskil,2015-10-08T11:32:55+0100,11:32:55+0100,lakranajems
3,,,5790,it helps reduce stress,Unknown/Unsure,new,,0.9.827,defect,major,eskil,2015-10-08T10:22:30+0100,10:22:30+0100,maryjanevojtkovmsp
3,,,5789,It’s no doubt a support,Unknown/Unsure,new,,0.9.827,defect,major,eskil,2015-10-08T09:45:08+0100,09:45:08+0100,eulaliaquispetcgy
3,,,5788,they didn't have trust on it,Unknown/Unsure,new,,0.9.827,defect,major,eskil,2015-10-08T09:23:41+0100,09:23:41+0100,mariellamcgillivraycyaq
4,Version 1.0,,5787,_Meet Mirena' Featurette & Early Evaluations,Other,new,,0.9.8,task,minor,eskil,2015-10-08T09:21:09+0100,09:21:09+0100,ValToro7414
3,,,5786,http://www.medicarehealthassess.com/natto5,Unknown/Unsure,new,,0.9.827,defect,major,eskil,2015-10-08T08:46:06+0100,08:46:06+0100,zoerileysam
3,,,5785,Sex Paris Hilton Between A New Lines Along With A Person Will By No Means Am Going To.,Unknown/Unsure,new,,0.9.827,defect,major,eskil,2015-10-08T08:18:40+0100,08:18:40+0100,renfihowco
3,,,5784,to open of capacity of,Unknown/Unsure,new,,0.9.827,defect,major,eskil,2015-10-08T08:01:01+0100,08:01:01+0100,harleybondtn
3,,,5783,http://www.magichealthandwellness.com/cerebrrin/,Unknown/Unsure,new,,0.9.827,defect,major,eskil,2015-10-08T07:58:10+0100,07:58:10+0100,anamikanazu
3,,,5782,the approach the neurochemical neurotransmitter,Unknown/Unsure,new,,0.9.827,defect,major,eskil,2015-10-08T07:26:57+0100,07:26:57+0100,yuterjuriya
3,,,5781,themselves began to utilize it and got,Unknown/Unsure,new,,0.9.827,defect,major,eskil,2015-10-08T07:09:13+0100,07:09:13+0100,onietofilvjpr
3,,,5780,"Kaley Cuoco Pictures A Person Will Appear A Model A Along The Lines Of, Peruse A Auction House.",Unknown/Unsure,new,,0.9.827,defect,major,eskil,2015-10-08T07:08:08+0100,07:08:08+0100,vrisallancong
3,,,5779,of the cerebral clearness? Does one discovery that,Unknown/Unsure,new,,0.9.827,defect,major,eskil,2015-10-08T06:52:06+0100,06:52:06+0100,usmisjams
3,,,5778,Now out of these neurons,Unknown/Unsure,new,,0.9.827,defect,major,eskil,2015-10-08T05:14:10+0100,05:14:10+0100,dortheaeilandghcl
3,,,5777,the fact record its full constituents or clinical studies,Unknown/Unsure,new,,0.9.827,defect,major,eskil,2015-10-08T05:04:56+0100,05:04:56+0100,lashundalanpheremikh
3,,,5776,your stamina and muscle building,Unknown/Unsure,new,,0.9.827,defect,major,eskil,2015-10-08T05:04:32+0100,05:04:32+0100,worsemijanee
3,,,5775,"Kaley Cuoco Fucking, A Person Checked Out At Damaged Hobo Sex As Atleast 20 A Few Seconds.",Unknown/Unsure,new,,0.9.827,defect,major,eskil,2015-10-08T01:55:11+0100,01:55:11+0100,plumlifeme
4,Version 1.0,,5774,Real-World Solutions For better eye vision,Plan Overview,new,,0.9.8.2.4,enhancement,minor,eskil,2015-10-07T23:20:28+0100,23:20:28+0100,WilsonSecombe1
3,,,5773,"Alyson Hannigan Full Sex Tape, Do It Yourself Along With Rape Are Able To Be Defended.",Unknown/Unsure,new,,0.9.827,defect,major,eskil,2015-10-07T20:11:23+0100,20:11:23+0100,roesamomo
3,,,5772,I Like It When Kate Upton See Through Cuts Absent Crazy Callers Mid-heading.,Unknown/Unsure,new,,0.9.827,defect,major,eskil,2015-10-07T20:01:44+0100,20:01:44+0100,closhaptihan
3,Version 1.0,,5771,URL,Gas Consumption,new,,0.9.8.2.4,task,major,eskil,2015-10-07T18:41:20+0100,18:41:20+0100,LarueDth516
3,Version 1.0,,5770,hairy pussy lips - The Downside Risk of Mature Hairy Pussy That No One is Talking About,Email Export,new,,0.9.8,enhancement,major,eskil,2015-10-07T17:37:55+0100,17:37:55+0100,ArlethaBowes19
4,Version 1.0,,5769,xxx porno muvis free - Why You Need A Free Videos Sex Tapes,Unknown/Unsure,new,,0.9.6,task,minor,eskil,2015-10-07T14:17:11+0100,14:17:11+0100,HowardOmar540
3,,,5768,greater part of people,Unknown/Unsure,new,,0.9.827,defect,major,eskil,2015-10-07T12:25:49+0100,12:25:49+0100,ardellekrupalqxf
3,,,5767,such that I began my voyage of expansion,Unknown/Unsure,new,,0.9.827,defect,major,eskil,2015-10-07T12:18:48+0100,12:18:48+0100,morganseftoncwcw
3,,,5766,the utilization of you can just,Unknown/Unsure,new,,0.9.827,defect,major,eskil,2015-10-07T12:13:35+0100,12:13:35+0100,Patleanjems
3,Version 1.0,,5765,Start Thinking About Koh Samui Villas For Perfect Holiday,CNS,new,,0.9.826,task,major,eskil,2015-10-07T12:12:46+0100,12:12:46+0100,JuliusNimmo7907
3,,,5764,l'exécution et de mise au point.,Unknown/Unsure,new,,0.9.827,defect,major,eskil,2015-10-07T12:05:20+0100,12:05:20+0100,lppowert
3,,,5763,one of many challenges most individuals face,Unknown/Unsure,new,,0.9.827,defect,major,eskil,2015-10-07T11:41:03+0100,11:41:03+0100,margaretpleitezcsao
4,Version 1.0,,5762,Fair Home Villas & Salon In Koh Samui,Unknown/Unsure,new,,0.9.2,enhancement,minor,eskil,2015-10-07T11:26:07+0100,11:26:07+0100,AlvaroBarr80036
3,Version 1.0,,5761,The Haven Given By Your Koh Samui Villas,CNS,new,,0.9.8.2,enhancement,major,eskil,2015-10-07T11:23:22+0100,11:23:22+0100,VanitaSouthwick
3,,,5760,The bank offered to record,Unknown/Unsure,new,,0.9.827,defect,major,eskil,2015-10-07T11:13:26+0100,11:13:26+0100,vondamiraclergtm
3,,,5759,pleasant and commit,Unknown/Unsure,new,,0.9.827,defect,major,eskil,2015-10-07T10:55:33+0100,10:55:33+0100,tarendelfuentebapb
4,Version 1.0,,5758,Most Readily Useful Koh Samui Villas,Bookmarks,new,,0.9.8.1,enhancement,minor,eskil,2015-10-07T10:33:57+0100,10:33:57+0100,NicoleBullard2
3,,,5757,is in a great shape. For using,Unknown/Unsure,new,,0.9.827,defect,major,eskil,2015-10-07T10:16:10+0100,10:16:10+0100,Russelltosan
3,,,5756,GC Fit 360 Garcinia Cambogia fat loss and also health supplement.,Unknown/Unsure,new,,0.9.827,defect,major,eskil,2015-10-07T08:51:55+0100,08:51:55+0100,gcfit360
3,,,5755,http://www.alliedhealthvms.net/male-perf,Unknown/Unsure,new,,0.9.827,defect,major,eskil,2015-10-07T08:40:19+0100,08:40:19+0100,briannsam
3,,,5754,Get a toned shaped body with garcinia cambogia premium,Unknown/Unsure,new,,0.9.827,defect,major,eskil,2015-10-07T08:05:56+0100,08:05:56+0100,ricardcrouc
3,,,5753,to take out your,Unknown/Unsure,new,,0.9.827,defect,major,eskil,2015-10-07T07:47:05+0100,07:47:05+0100,jasonbondtn
3,,,5752,to take out your,Unknown/Unsure,new,,0.9.827,defect,major,eskil,2015-10-07T07:46:35+0100,07:46:35+0100,jasonbondtn
3,,,5751,"innocent, and 100 percent safe formula to use",Unknown/Unsure,new,,0.9.827,defect,major,eskil,2015-10-07T07:11:41+0100,07:11:41+0100,atolisjams
3,,,5750,greater part of people,Unknown/Unsure,new,,0.9.827,defect,major,eskil,2015-10-07T05:30:18+0100,05:30:18+0100,ruthbalmeswdxu
3,,,5749,consideration of the more attractive sex,Unknown/Unsure,new,,0.9.827,defect,major,eskil,2015-10-07T05:27:00+0100,05:27:00+0100,kristelkirovacskbe
3,,,5748,wholesome supplement that is,Unknown/Unsure,new,,0.9.827,defect,major,eskil,2015-10-07T05:08:58+0100,05:08:58+0100,myragrossenleni
3,,,5747,There is nothing flawed in pronouncing,Unknown/Unsure,new,,0.9.827,defect,major,eskil,2015-10-07T04:49:40+0100,04:49:40+0100,piedadthonexvnn
4,Version 1.0,,5746,Benefits Of A Home Water Softener,Profile Display,new,,0.9.8.2,enhancement,minor,eskil,2015-10-07T04:11:42+0100,04:11:42+0100,KaceyGilfillan
4,Version 1.0,,5745,Add A New Look To Your Home,Plan Overview,new,,0.9.2,enhancement,minor,eskil,2015-10-07T03:22:51+0100,03:22:51+0100,BrennaQce33299
2,Version 1.0,,5744,Benefits Of Soft Water,ZHL16,new,,0.9.8.2.4,task,critical,eskil,2015-10-07T02:12:50+0100,02:12:50+0100,MaiSelfe9183
4,Version 1.0,,5743,How Water Softener Resin functions,Profile Display,new,,0.9.8.1,enhancement,minor,eskil,2015-10-07T01:44:17+0100,01:44:17+0100,Brock225885916
3,,,5742,those element may hurt them gravely,Unknown/Unsure,new,,0.9.827,defect,major,eskil,2015-10-06T21:23:52+0100,21:23:52+0100,luterjuriya
3,,,5741,"Ryan Gosling Naked, A Lot Of Already Been 1 Handle For Two Weights.",Unknown/Unsure,new,,0.9.827,defect,major,eskil,2015-10-06T20:25:31+0100,20:25:31+0100,chelwooldpenri
3,,,5740,Sandra Martinez Is Almost Always A New Way To Go With A Few Company.,Unknown/Unsure,new,,0.9.827,defect,major,eskil,2015-10-06T20:21:30+0100,20:21:30+0100,merdicurpo
3,Version 1.0,,5739,Necessary Elements In gun rights lawyers - For Adults,ZHL16,new,,0.9,enhancement,major,eskil,2015-10-06T19:07:28+0100,19:07:28+0100,Vaughn1991
3,,,5738,"Demi Lovato Nude, A Shit Is Accessing Absurd.",Unknown/Unsure,new,,0.9.827,defect,major,eskil,2015-10-06T13:01:13+0100,13:01:13+0100,dabtisonco
3,,,5737,it will work for you,Unknown/Unsure,new,,0.9.827,defect,major,eskil,2015-10-06T12:50:40+0100,12:50:40+0100,tilliepietschkmle
3,,,5736,which is uncommonly intended,Unknown/Unsure,new,,0.9.827,defect,major,eskil,2015-10-06T12:40:53+0100,12:40:53+0100,karriedoughtonhfab
3,,,5735,that artificial pills however a typical formulation made in facility,Unknown/Unsure,new,,0.9.827,defect,major,eskil,2015-10-06T12:15:09+0100,12:15:09+0100,sueravenelztnj
3,,,5734,with sustenance once,Unknown/Unsure,new,,0.9.827,defect,major,eskil,2015-10-06T11:44:14+0100,11:44:14+0100,sierraancrumndyq
3,,,5733,"margarine), they don",Unknown/Unsure,new,,0.9.827,defect,major,eskil,2015-10-06T11:43:19+0100,11:43:19+0100,sierraancrumndyq
3,,,5732,This may increasingly fetch,Unknown/Unsure,new,,0.9.827,defect,major,eskil,2015-10-06T10:43:33+0100,10:43:33+0100,clementinebanikkzyg
3,Version 1.0,,5731,Hard drinking Water And Hair Breakage In Black Hair Care,Plan Overview,new,,0.9.1,task,major,eskil,2015-10-06T09:59:47+0100,09:59:47+0100,BeauBoswell734
3,,,5730,I myself am one of its clients,Unknown/Unsure,new,,0.9.827,defect,major,eskil,2015-10-06T09:32:46+0100,09:32:46+0100,simonnefrommercflb
3,,,5729,Elite test 360S easoned Costs & Repayment Coverage,Unknown/Unsure,new,,0.9.827,defect,major,eskil,2015-10-06T09:02:48+0100,09:02:48+0100,warkarsetrete
3,,,5728,http://www.alliedhealthvms.net/geniux-brain-booster/,Unknown/Unsure,new,,0.9.827,defect,major,eskil,2015-10-06T08:27:01+0100,08:27:01+0100,sunmbalsam
3,,,5727,Farrah Abraham Free Uncensored Sex Tape Pics Awwww Absolute Easy To Fap To.,Unknown/Unsure,new,,0.9.827,defect,major,eskil,2015-10-06T08:11:36+0100,08:11:36+0100,portgicema
3,,,5726,Bst provide mental clarity with cerebrrin pill,Unknown/Unsure,new,,0.9.827,defect,major,eskil,2015-10-06T08:00:40+0100,08:00:40+0100,isacbunke
3,,,5725,Working which is sent by just,Unknown/Unsure,new,,0.9.827,defect,major,eskil,2015-10-06T07:42:09+0100,07:42:09+0100,missujams
3,,,5724,support them in getting huge endeavors.,Unknown/Unsure,new,,0.9.827,defect,major,eskil,2015-10-06T07:25:47+0100,07:25:47+0100,suterjuriya
2,Version 1.0,,5723,The Villas On Koh Samui,Unknown/Unsure,new,,0.9.7,enhancement,critical,eskil,2015-10-06T06:49:37+0100,06:49:37+0100,DorethaMcClellan
3,,,5722,there in one-of-a-kind ingredients,Unknown/Unsure,new,,0.9.827,defect,major,eskil,2015-10-06T06:44:08+0100,06:44:08+0100,wortenjanee
2,Version 1.0,,5721,Confused With A Plumbing problem? Read This Piece,VPM/B,new,,0.9.8.1,task,critical,eskil,2015-10-06T06:26:48+0100,06:26:48+0100,ChrisPethard5
3,,,5720,also as some sure medical websites to,Unknown/Unsure,new,,0.9.827,defect,major,eskil,2015-10-06T06:15:57+0100,06:15:57+0100,christateresizhze
3,,,5719,As a result of the restricted radicals,Unknown/Unsure,new,,0.9.827,defect,major,eskil,2015-10-06T06:04:52+0100,06:04:52+0100,josephinerjakap
4,Version 1.0,,5718,Samui Holiday Homes,Gas Consumption,new,,0.9.8.2.3,task,minor,eskil,2015-10-06T06:02:33+0100,06:02:33+0100,Virgilio55S
3,,,5717,As a result of the restricted radicals,Unknown/Unsure,new,,0.9.827,defect,major,eskil,2015-10-06T06:01:12+0100,06:01:12+0100,josephinerjakap
3,Version 1.0,,5716,"Koh Samui Deluxe Villa Leasing, Private Getaway Villa",Level Editor,new,,0.9.8,enhancement,major,eskil,2015-10-06T05:39:54+0100,05:39:54+0100,DorethaMcClellan
3,,,5715,Skin maturing is a typical,Unknown/Unsure,new,,0.9.827,defect,major,eskil,2015-10-06T05:32:45+0100,05:32:45+0100,sungmandolinivwsz
3,Version 1.0,,5714,14 Thai Resorts To Ignite Your Wanderlust,Gas Consumption,new,,0.9.7.2,enhancement,major,eskil,2015-10-06T05:20:20+0100,05:20:20+0100,GrettaBarkly
3,,,5713,"In today's reality, practicing",Unknown/Unsure,new,,0.9.827,defect,major,eskil,2015-10-06T05:17:16+0100,05:17:16+0100,edenebbertweay
3,,,5712,this strong components,Unknown/Unsure,new,,0.9.827,defect,major,eskil,2015-10-06T05:09:59+0100,05:09:59+0100,iselacocciaekdw
3,,,5711,this strong components,Unknown/Unsure,new,,0.9.827,defect,major,eskil,2015-10-06T05:09:53+0100,05:09:53+0100,iselacocciaekdw
4,Version 1.0,,5710,Painless Programs For women's clothing amazon - A Closer Look,Gas Consumption,new,,0.9.4,task,minor,eskil,2015-10-06T02:50:47+0100,02:50:47+0100,FelicaEichel
3,Version 1.0,,5709,10 Best Pool Villas In Samui,VPM/B,new,,0.9.7.1,enhancement,major,eskil,2015-10-06T02:28:54+0100,02:28:54+0100,MikkiLts920578
2,Version 1.0,,5708,Sandalwood Luxury Villas (Ko Samui,Gas Consumption,new,,0.9.826,task,critical,eskil,2015-10-06T01:50:11+0100,01:50:11+0100,AlvaroBarr80036
3,Version 1.0,,5707,"Koh Samui Villa In Surat Thani, Koh Samui, Thailand",ZHL16,new,,0.9.7,task,major,eskil,2015-10-06T01:27:36+0100,01:27:36+0100,YvetteGarvan75
3,Version 1.0,,5706,The Most Perfect Villas On Koh Samui,Other,new,,0.9.8.2,task,major,eskil,2015-10-06T00:37:31+0100,00:37:31+0100,JuliusNimmo7907
3,,,5705,He Is The Kim Kardashian Sex Tape Nsfw Of A Puppet.,Unknown/Unsure,new,,0.9.827,defect,major,eskil,2015-10-06T00:12:33+0100,00:12:33+0100,siohelmillkerc
3,,,5704,Best Affordable Dui Attorney Dogs 're Absolutely Frustrated More Often Than Not.,Unknown/Unsure,new,,0.9.827,defect,major,eskil,2015-10-06T00:04:58+0100,00:04:58+0100,kibiblusus
4,Version 1.0,,5703,The Haven Given By Your Koh Samui Villas,Bookmarks,new,,0.9.6,task,minor,eskil,2015-10-05T23:13:40+0100,23:13:40+0100,VanitaSouthwick
2,Version 1.0,,5702,Travel Mania,VPM/B,new,,0.9.5,enhancement,critical,eskil,2015-10-05T23:04:38+0100,23:04:38+0100,MonserrateTreat
3,,,5701,"Kim Kardashian Kanye West Is Absolutely Printing A Backbone, Not Making A Person's Game.",Unknown/Unsure,new,,0.9.827,defect,major,eskil,2015-10-05T23:00:02+0100,23:00:02+0100,unalemves
3,Version 1.0,,5700,Deluxe Villas And Houses,Gas Consumption,new,,0.9.7,enhancement,major,eskil,2015-10-05T20:57:00+0100,20:57:00+0100,RobbyAlba025128
4,Version 1.0,,5699,How To maintain Plumbing Unclogged,Unknown/Unsure,new,,0.9.8,task,minor,eskil,2015-10-05T14:09:42+0100,14:09:42+0100,MarylynGaskin35
3,,,5698,Skin Care Ideas To Keep Your Skin Glowing,Unknown/Unsure,new,,0.9.827,defect,major,eskil,2015-10-05T13:59:09+0100,13:59:09+0100,Richaelgehee
3,,,5697,drifted around 8 pounds,Unknown/Unsure,new,,0.9.827,defect,major,eskil,2015-10-05T12:52:29+0100,12:52:29+0100,loisjuriyamum
3,,,5696,The viability of is ensured,Unknown/Unsure,new,,0.9.827,defect,major,eskil,2015-10-05T11:28:55+0100,11:28:55+0100,fairyeskeqwbs
3,,,5695,solution for someone who,Unknown/Unsure,new,,0.9.827,defect,major,eskil,2015-10-05T11:10:28+0100,11:10:28+0100,clarethaminaaiuobg
3,,,5694,to arrange. At,Unknown/Unsure,new,,0.9.827,defect,major,eskil,2015-10-05T10:37:45+0100,10:37:45+0100,jaredbondtn
3,,,5693,to arrange. At,Unknown/Unsure,new,,0.9.827,defect,major,eskil,2015-10-05T10:36:15+0100,10:36:15+0100,jaredbondtn
3,,,5692,You have to run with this most intricate however,Unknown/Unsure,new,,0.9.827,defect,major,eskil,2015-10-05T09:46:46+0100,09:46:46+0100,kimberleesarffmiyr
3,,,5691,You have to run with this most intricate however,Unknown/Unsure,new,,0.9.827,defect,major,eskil,2015-10-05T09:46:05+0100,09:46:05+0100,kimberleesarffmiyr
3,,,5690,select green coffee now is available at reasonable rate,Unknown/Unsure,new,,0.9.827,defect,major,eskil,2015-10-05T09:31:38+0100,09:31:38+0100,claudibelova
3,,,5689,Jennifer Hudson has battled with,Unknown/Unsure,new,,0.9.827,defect,major,eskil,2015-10-05T09:30:26+0100,09:30:26+0100,demetriaronnecxpq
3,,,5688,As soon as you would like mastering,Unknown/Unsure,new,,0.9.827,defect,major,eskil,2015-10-05T08:45:36+0100,08:45:36+0100,sumansazo1
3,,,5687,drifted around,Unknown/Unsure,new,,0.9.827,defect,major,eskil,2015-10-05T07:18:42+0100,07:18:42+0100,stepaniesonnerkjqa
3,,,5686,Professionals will gain a competitive advantage,Unknown/Unsure,new,,0.9.827,defect,major,eskil,2015-10-05T06:52:14+0100,06:52:14+0100,yegikjams
3,,,5685,more-textured interface,Unknown/Unsure,new,,0.9.827,defect,major,eskil,2015-10-05T05:32:47+0100,05:32:47+0100,jerlenelangwithsmpx
3,,,5684,This suitable,Unknown/Unsure,new,,0.9.827,defect,major,eskil,2015-10-05T05:29:25+0100,05:29:25+0100,savannahpavyyroi
3,,,5683,There is nothing flawed in pronouncing,Unknown/Unsure,new,,0.9.827,defect,major,eskil,2015-10-05T04:59:04+0100,04:59:04+0100,maudflatteryonii
3,,,5682,giving your body a watchful equalization of every single,Unknown/Unsure,new,,0.9.827,defect,major,eskil,2015-10-04T22:11:34+0100,22:11:34+0100,milziyajuriya
3,,,5681,"Formerly, my whole time a gigantic live would",Unknown/Unsure,new,,0.9.827,defect,major,eskil,2015-10-04T20:15:19+0100,20:15:19+0100,JenalJuriya
3,,,5680,distinctive supplements which can be designed,Unknown/Unsure,new,,0.9.827,defect,major,eskil,2015-10-04T18:27:56+0100,18:27:56+0100,silkonjanees
3,Version 1.0,,5679,Water Softener Salts: discover some Thing About Them,Plan Settings,new,,0.9.6,enhancement,major,eskil,2015-10-04T16:23:03+0100,16:23:03+0100,Isis83Q868699
4,Version 1.0,,5678,Does The Salt totally Free Water Softener truly function?,Email Export,new,,0.9.8.2.3,enhancement,minor,eskil,2015-10-04T15:18:50+0100,15:18:50+0100,LavonneW17
2,Version 1.0,,5677,When To Adopt Foundation Repair,Level Editor,new,,0.9.6,enhancement,critical,eskil,2015-10-04T10:14:54+0100,10:14:54+0100,TandyBurgin
2,Version 1.0,,5676,"Anantara Bophut Resort & Spa. Koh Samui, Thailand. Finest Resort Critiques",Profile Display,new,,0.9.8.2.4,task,critical,eskil,2018-03-30T00:06:35+0100,06:58:15+0100,Jett230089
2,Version 1.0,,5675,W Retreat Koh Samui L Official Website,Unknown/Unsure,new,,0.9.8.2.3,task,critical,eskil,2015-10-04T04:32:37+0100,04:32:37+0100,KSSJenny906111
3,,,5674,this supplement to my companions and associates.,Unknown/Unsure,new,,0.9.827,defect,major,eskil,2015-10-04T00:10:47+0100,00:10:47+0100,Juterjuriya
2,Version 1.0,,5673,Inside Thailand's High Resorts (PICTURES),Bookmarks,new,,0.9.8.1,enhancement,critical,eskil,2015-10-03T16:26:44+0100,16:26:44+0100,JerroldDaecher3
4,Version 1.0,,5672,X2 Samui Resort,Profile Display,new,,0.9.2,enhancement,minor,eskil,2015-10-03T14:35:59+0100,14:35:59+0100,ShariMaple
2,Version 1.0,,5671,The Sukhothai Bangkok To Provide White Alba Truffles At La Scala In December,Plan Overview,new,,0.9.3,enhancement,critical,eskil,2015-10-03T14:04:01+0100,14:04:01+0100,JerroldDaecher3
3,,,5670,to assist you,Unknown/Unsure,new,,0.9.827,defect,major,eskil,2015-10-03T11:35:18+0100,11:35:18+0100,jefferybondtn
3,,,5669,Its List of Benefits…Increased,Unknown/Unsure,new,,0.9.827,defect,major,eskil,2015-10-03T11:33:51+0100,11:33:51+0100,sumansaar
3,,,5668,This post goes to assist you in choosing,Unknown/Unsure,new,,0.9.827,defect,major,eskil,2015-10-03T10:56:03+0100,10:56:03+0100,theolasobczynskimnaz
3,,,5667,"expand levels of serotonin,",Unknown/Unsure,new,,0.9.827,defect,major,eskil,2015-10-03T10:42:01+0100,10:42:01+0100,valeriesunshinedeot